Target
Histone deacetylase 8
Ligand
BDBM50361256
Substrate
Meas. Tech.
ChEMBL_795339 (CHEMBL1937195)
Kd
13000±n/a nM
Citation
 Henkes, LMHaus, PJäger, FLudwig, JMeyer-Almes, FJ Synthesis and biochemical analysis of 2,2,3,3,4,4,5,5,6,6,7,7-dodecafluoro-N-hydroxy-octanediamides as inhibitors of human histone deacetylases. Bioorg Med Chem 20:985-95 (2012)  
Target
Name:
Histone deacetylase 8
Synonyms:
HD8 HDAC8_HUMAN Histone deacetylase 8 (HDAC-8) | Human HDAC8
Type:
Enzyme
Mol. Mass.:
41749.60
Organism:
Homo sapiens (Human)
Description:
Q9BY41
Residue:
377
  
Inhibitor
Name:
BDBM50361256
Synonyms:
CHEMBL1934898
Type:
Small organic molecule
Emp. Form.:
C16H12F12N2O3
Mol. Mass.:
508.2589
SMILES:
CCc1cccc(NC(=O)C(F)(F)C(F)(F)C(F)(F)C(F)(F)C(F)(F)C(F)(F)C(=O)NO)c1
: