Target
Adenosine receptor A3
Ligand
BDBM50051241
Substrate
Meas. Tech.
ChEMBL_794927 (CHEMBL1936206)
Ki
>10000±n/a nM
Citation
 Baraldi, PGSaponaro, GAghazadeh Tabrizi, MBaraldi, SRomagnoli, RMoorman, ARVarani, KBorea, PAPreti, D Pyrrolo- and pyrazolo-[3,4-e][1,2,4]triazolo[1,5-c]pyrimidines as adenosine receptor antagonists. Bioorg Med Chem 20:1046-59 (2012)  
Target
Name:
Adenosine receptor A3
Synonyms:
A3 adenosine receptor (hA3) ADORA3 | Adenosine A3 receptor (A3AR)
Type:
G Protein-Coupled Receptor (GPCR)
Mol. Mass.:
36197.32
Organism:
Homo sapiens (Human)
Description:
P0DMS8
Residue:
318
  
Inhibitor
Name:
BDBM50051241
Synonyms:
2-(furan-2-yl)-7-(3-phenylpropyl)-7H-pyrazolo[4,3-e][1,2,4]triazolo[1,5-c]pyrimidin-5-amine 2-Furan-2-yl-7-(3-phenyl-propyl)-7H-pyrazolo[4,3-e][1,2,4]triazolo[1,5-c]pyrimidin-5-ylamine(SCH 63390) SCH-63390
Type:
Small organic molecule
Emp. Form.:
C19H17N7O
Mol. Mass.:
359.3846
SMILES:
Nc1nc2n(CCCc3ccccc3)ncc2c2nc(nn12)-c1ccco1
: