Target
Adenosine receptor A2b
Ligand
BDBM50361310
Substrate
Meas. Tech.
ChEMBL_794928 (CHEMBL1936207)
IC50
548±n/a nM
Citation
 Baraldi, PGSaponaro, GAghazadeh Tabrizi, MBaraldi, SRomagnoli, RMoorman, ARVarani, KBorea, PAPreti, D Pyrrolo- and pyrazolo-[3,4-e][1,2,4]triazolo[1,5-c]pyrimidines as adenosine receptor antagonists. Bioorg Med Chem 20:1046-59 (2012)  
Target
Name:
Adenosine receptor A2b
Synonyms:
AA2BR_HUMAN ADORA2B Adenosine receptors A2b | Adenosine receptors; A2a & A2b
Type:
G Protein-Coupled Receptor (GPCR)
Mol. Mass.:
36341.22
Organism:
Homo sapiens (Human)
Description:
Residue:
332
  
Inhibitor
Name:
BDBM50361310
Synonyms:
CHEMBL1935766
Type:
Small organic molecule
Emp. Form.:
C26H22N8O3
Mol. Mass.:
494.5047
SMILES:
COc1ccc(NC(=O)Nc2nc3cn(CCc4ccccc4)nc3c3nc(nn23)-c2ccco2)cc1
: