Target
Adenosine receptor A1
Ligand
BDBM50361315
Substrate
Meas. Tech.
ChEMBL_794898 (CHEMBL1936134)
Ki
>1000±n/a nM
Citation
 Baraldi, PGSaponaro, GAghazadeh Tabrizi, MBaraldi, SRomagnoli, RMoorman, ARVarani, KBorea, PAPreti, D Pyrrolo- and pyrazolo-[3,4-e][1,2,4]triazolo[1,5-c]pyrimidines as adenosine receptor antagonists. Bioorg Med Chem 20:1046-59 (2012)  
Target
Name:
Adenosine receptor A1
Synonyms:
A1 adenosine receptor (hA1) AA1R_HUMAN ADORA1 Adenosine A1-receptor Adenosine receptor A1 (hA1) | Adenosine transporter (AdT)
Type:
G Protein-Coupled Receptor (GPCR)
Mol. Mass.:
36520.92
Organism:
Homo sapiens (Human)
Description:
P30542
Residue:
326
  
Inhibitor
Name:
BDBM50361315
Synonyms:
CHEMBL1935771
Type:
Small organic molecule
Emp. Form.:
C21H20N8O
Mol. Mass.:
400.4365
SMILES:
Cn1ncc2nc(N3CCN(CC3)c3ccccc3)n3nc(nc3c12)-c1ccco1
: