Target
Adenosine receptor A3
Ligand
BDBM50361326
Substrate
Meas. Tech.
ChEMBL_794929 (CHEMBL1936208)
IC50
500±n/a nM
Citation
 Baraldi, PGSaponaro, GAghazadeh Tabrizi, MBaraldi, SRomagnoli, RMoorman, ARVarani, KBorea, PAPreti, D Pyrrolo- and pyrazolo-[3,4-e][1,2,4]triazolo[1,5-c]pyrimidines as adenosine receptor antagonists. Bioorg Med Chem 20:1046-59 (2012)  
Target
Name:
Adenosine receptor A3
Synonyms:
A3 adenosine receptor (hA3) ADORA3 | Adenosine A3 receptor (A3AR)
Type:
G Protein-Coupled Receptor (GPCR)
Mol. Mass.:
36197.32
Organism:
Homo sapiens (Human)
Description:
P0DMS8
Residue:
318
  
Inhibitor
Name:
BDBM50361326
Synonyms:
CHEMBL1935753
Type:
Small organic molecule
Emp. Form.:
C13H13N7O
Mol. Mass.:
283.2886
SMILES:
CCCn1ncc2nc(N)n3nc(nc3c12)-c1ccco1
: