Target
Peroxisome proliferator-activated receptor alpha
Ligand
BDBM50361352
Substrate
Meas. Tech.
ChEMBL_795136 (CHEMBL1936608)
EC50
>10000±n/a nM
Citation
 Rikimaru, KWakabayashi, TAbe, HImoto, HMaekawa, TUjikawa, OMurase, KMatsuo, TMatsumoto, MNomura, CTsuge, HArimura, NKawakami, KSakamoto, JFunami, MMol, CDSnell, GPBragstad, KASang, BCDougan, DRTanaka, TKatayama, NHoriguchi, YMomose, Y A new class of non-thiazolidinedione, non-carboxylic-acid-based highly selective peroxisome proliferator-activated receptor (PPAR)¿ agonists: design and synthesis of benzylpyrazole acylsulfonamides. Bioorg Med Chem 20:714-33 (2012)  
Target
Name:
Peroxisome proliferator-activated receptor alpha
Synonyms:
NR1C1 PPAR PPAR-alpha PPARA_HUMAN Peroxisome proliferator-activated receptor | Peroxisome proliferator-activated receptor alpha (PPAR alpha)
Type:
Enzyme
Mol. Mass.:
52222.08
Organism:
Homo sapiens (Human)
Description:
Q07869
Residue:
468
  
Inhibitor
Name:
BDBM50361352
Synonyms:
CHEMBL1933826
Type:
Small organic molecule
Emp. Form.:
C22H29Cl2N3O4S
Mol. Mass.:
502.454
SMILES:
CC(C)Oc1cc(CCC(=O)NS(=O)(=O)C2CCCCC2)n(Cc2ccc(Cl)cc2Cl)n1
: