Target
Perforin-1
Ligand
BDBM50361400
Substrate
Meas. Tech.
ChEMBL_794525 (CHEMBL1936847)
IC50
780±n/a nM
Citation
 Spicer, JAHuttunen, KMMiller, CKDenny, WACiccone, ABrowne, KATrapani, JA Inhibition of the pore-forming protein perforin by a series of aryl-substituted isobenzofuran-1(3H)-ones. Bioorg Med Chem 20:1319-36 (2012)  
Target
Name:
Perforin-1
Synonyms:
PERF_HUMAN PRF1
Type:
PROTEIN
Mol. Mass.:
61392.32
Organism:
Homo sapiens (Human)
Description:
ChEMBL_1285138
Residue:
555
  
Inhibitor
Name:
BDBM50361400
Synonyms:
CHEMBL1934364
Type:
Small organic molecule
Emp. Form.:
C16H10N2O3S2
Mol. Mass.:
342.392
SMILES:
O=C1NC(=S)NC1=Cc1ccc(s1)-c1ccc2C(=O)OCc2c1
: