Target
Histone deacetylase 6
Ligand
BDBM50361444
Substrate
Meas. Tech.
ChEMBL_796809 (CHEMBL1943839)
IC50
25.7±n/a nM
Citation
 Varasi, MThaler, FAbate, ABigogno, CBoggio, RCarenzi, GCataudella, TDal Zuffo, RFulco, MCRozio, MGMai, ADondio, GMinucci, SMercurio, C Discovery, synthesis, and pharmacological evaluation of spiropiperidine hydroxamic acid based derivatives as structurally novel histone deacetylase (HDAC) inhibitors. J Med Chem 54:3051-64 (2011)  
Target
Name:
Histone deacetylase 6
Synonyms:
Cereblon/Histone deacetylase 6 HDAC6 Histone deacetylase 6 (HDAC6) KIAA0901 | ORF Names:JM21
Type:
Chromatin regulator; hydrolase; repressor
Mol. Mass.:
131381.51
Organism:
Homo sapiens (Human)
Description:
Q9UBN7
Residue:
1215
  
Inhibitor
Name:
BDBM50361444
Synonyms:
CHEMBL1938433
Type:
Small organic molecule
Emp. Form.:
C23H24N2O4
Mol. Mass.:
392.4477
SMILES:
ONC(=O)C=Cc1ccc2OC3(CCN(Cc4ccccc4)CC3)CC(=O)c2c1
: