Target
Mitogen-activated protein kinase 14
Ligand
BDBM50361467
Substrate
Meas. Tech.
ChEMBL_797142 (CHEMBL1942369)
Kd
0.001000±n/a nM
Citation
 Millan, DSBunnage, MEBurrows, JLButcher, KJDodd, PGEvans, TJFairman, DAHughes, SJKilty, ICLemaitre, ALewthwaite, RAMahnke, AMathias, JPPhilip, JSmith, RTStefaniak, MHYeadon, MPhillips, C Design and synthesis of inhaled p38 inhibitors for the treatment of chronic obstructive pulmonary disease. J Med Chem 54:7797-814 (2011)  
Target
Name:
Mitogen-activated protein kinase 14
Synonyms:
CSAID-binding protein CSBP1 CSPB1 MAP kinase 14 MAP kinase p38 alpha MAPK14 MK14_HUMAN Mitogen-activated protein kinase p38 alpha Stress-activated protein kinase 2a | p38 MAP kinase alpha/beta
Type:
Serine/threonine-protein kinase
Mol. Mass.:
41286.76
Organism:
Homo sapiens (Human)
Description:
Q16539
Residue:
360
  
Inhibitor
Name:
BDBM50361467
Synonyms:
CHEMBL1938400
Type:
Small organic molecule
Emp. Form.:
C35H34ClN7O3S2
Mol. Mass.:
700.273
SMILES:
CC(C)(C)c1cc(NC(=O)NCc2ccccc2Sc2ccc3nnc(-c4ccccc4SCCO)n3c2)n(n1)-c1ccc(O)c(Cl)c1
: