Target
Lysine-specific histone demethylase 1A
Ligand
BDBM50105417
Substrate
Meas. Tech.
ChEMBL_797212 (CHEMBL1942527)
Ki
18000±n/a nM
Citation
 Suzuki, TMiyata, N Lysine demethylases inhibitors. J Med Chem 54:8236-50 (2011)  
Target
Name:
Lysine-specific histone demethylase 1A
Synonyms:
AOF2 Flavin-containing amine oxidase domain-containing protein 2 KDM1A KIAA0601 Lysine-specific demethylase 1 (LSD1) Lysine-specific histone demethylase 1 (LSD1)
Type:
Enzyme
Mol. Mass.:
92901.01
Organism:
Homo sapiens (Human)
Description:
O60341
Residue:
852
  
Inhibitor
Name:
BDBM50105417
Synonyms:
CHEMBL1089 PHENELZINE | Phenethyl-hydrazine
Type:
Small organic molecule
Emp. Form.:
C8H12N2
Mol. Mass.:
136.1943
SMILES:
NNCCc1ccccc1
: