Target
Pyruvate kinase PKM
Ligand
BDBM50361493
Substrate
Meas. Tech.
ChEMBL_797232 (CHEMBL1942547)
EC50
90±n/a nM
Citation
 Walsh, MJBrimacombe, KRVeith, HBougie, JMDaniel, TLeister, WCantley, LCIsraelsen, WJVander Heiden, MGShen, MAuld, DSThomas, CJBoxer, MB 2-Oxo-N-aryl-1,2,3,4-tetrahydroquinoline-6-sulfonamides as activators of the tumor cell specific M2 isoform of pyruvate kinase. Bioorg Med Chem Lett 21:6322-7 (2011)  
Target
Name:
Pyruvate kinase PKM
Synonyms:
KPYM_HUMAN PK2 PKM Pyruvate kinase (PKM2)
Type:
Protein
Mol. Mass.:
57944.31
Organism:
Homo sapiens (Human)
Description:
P14618
Residue:
531
  
Inhibitor
Name:
BDBM50361493
Synonyms:
CHEMBL1939110
Type:
Small organic molecule
Emp. Form.:
C15H11ClF2N2O3S
Mol. Mass.:
372.774
SMILES:
Fc1ccc(NS(=O)(=O)c2cc3CCC(=O)Nc3cc2F)cc1Cl
: