Target
Hepatocyte growth factor receptor
Ligand
BDBM50361565
Substrate
Meas. Tech.
ChEMBL_796983 (CHEMBL1944058)
IC50
34±n/a nM
Citation
 Milkiewicz, KLAimone, LDAlbom, MSAngeles, TSChang, HGrobelny, JVHusten, JLosardo, CMiknyoczki, SMurthy, SRolon-Steele, DUnderiner, TLWeinberg, LRWorrell, CSZeigler, KSDorsey, BD Improvement in oral bioavailability of 2,4-diaminopyrimidine c-Met inhibitors by incorporation of a 3-amidobenzazepin-2-one group. Bioorg Med Chem 19:6274-84 (2011)  
Target
Name:
Hepatocyte growth factor receptor
Synonyms:
Hepatocyte growth factor receptor Hepatocyte growth factor receptor (c-MET) MET Met proto-oncogene (hepatocyte growth factor receptor) Tyrosine-protein kinase Met (c-Met) c-Met kinase
Type:
Protein
Mol. Mass.:
155559.73
Organism:
Homo sapiens (Human)
Description:
P08581
Residue:
1390
  
Inhibitor
Name:
BDBM50361565
Synonyms:
CHEMBL1939492
Type:
Small organic molecule
Emp. Form.:
C29H32ClFN8O3
Mol. Mass.:
595.068
SMILES:
CNC(=O)c1cccc(F)c1Nc1nc(Nc2ccc3c(NC(=O)[C@H](CC3(C)C)NC(=O)N3CCCC3)c2)ncc1Cl
: