Target
Insulin receptor
Ligand
BDBM50361563
Substrate
Meas. Tech.
ChEMBL_796984 (CHEMBL1944059)
IC50
2999±n/a nM
Citation
 Milkiewicz, KLAimone, LDAlbom, MSAngeles, TSChang, HGrobelny, JVHusten, JLosardo, CMiknyoczki, SMurthy, SRolon-Steele, DUnderiner, TLWeinberg, LRWorrell, CSZeigler, KSDorsey, BD Improvement in oral bioavailability of 2,4-diaminopyrimidine c-Met inhibitors by incorporation of a 3-amidobenzazepin-2-one group. Bioorg Med Chem 19:6274-84 (2011)  
Target
Name:
Insulin receptor
Synonyms:
INSR INSR_HUMAN Insulin receptor beta subunit
Type:
Receptor Tyrosine Kinase
Mol. Mass.:
156322.60
Organism:
Homo sapiens (Human)
Description:
P06213
Residue:
1382
  
Inhibitor
Name:
BDBM50361563
Synonyms:
CHEMBL1939489
Type:
Small organic molecule
Emp. Form.:
C27H29ClFN7O4
Mol. Mass.:
570.015
SMILES:
CNC(=O)c1cccc(F)c1Nc1nc(Nc2ccc3c(NC(=O)[C@H](CC3(C)C)NC(=O)COC)c2)ncc1Cl
: