Target
Prostaglandin G/H synthase 2
Ligand
BDBM50361584
Substrate
Meas. Tech.
ChEMBL_799066 (CHEMBL1941925)
IC50
7.3±n/a nM
Citation
 Biava, MPorretta, GCPoce, GBattilocchio, CAlfonso, SRovini, MValenti, SGiorgi, GCalderone, VMartelli, ATestai, LSautebin, LRossi, APapa, GGhelardini, CDi Cesare Mannelli, LGiordani, AAnzellotti, PBruno, APatrignani, PAnzini, M Novel analgesic/anti-inflammatory agents: diarylpyrrole acetic esters endowed with nitric oxide releasing properties. J Med Chem 54:7759-71 (2011)  
Target
Name:
Prostaglandin G/H synthase 2
Synonyms:
Cox-2 Cyclooxygenase-2 Glucocorticoid-regulated inflammatory cyclooxygenase Macrophage activation-associated marker protein P71/73 PGH synthase 2 PGHS-2 Pghs-b Prostaglandin H2 synthase 2 Ptgs2 Tis10
Type:
Protein
Mol. Mass.:
69020.39
Organism:
Mus musculus (Mouse)
Description:
Q05769
Residue:
604
  
Inhibitor
Name:
BDBM50361584
Synonyms:
CHEMBL1939671
Type:
Small organic molecule
Emp. Form.:
C23H23FN2O7S
Mol. Mass.:
490.501
SMILES:
Cc1c(CC(=O)OCCCO[N+]([O-])=O)cc(-c2ccc(cc2)S(C)(=O)=O)n1-c1cccc(F)c1
: