Target
Amine oxidase [flavin-containing] B
Ligand
BDBM50361604
Substrate
Meas. Tech.
ChEMBL_799140 (CHEMBL1942124)
Ki
625000±n/a nM
Citation
 Valente, STomassi, STempera, GSaccoccio, SAgostinelli, EMai, A Novel reversible monoamine oxidase A inhibitors: highly potent and selective 3-(1H-pyrrol-3-yl)-2-oxazolidinones. J Med Chem 54:8228-32 (2011)  
Target
Name:
Amine oxidase [flavin-containing] B
Synonyms:
AOFB_BOVIN MAO-B Monoamine Oxidase Type B (MAO-B) Monoamine oxidase B | Monoamine oxidase type B
Type:
PROTEIN
Mol. Mass.:
58428.94
Organism:
Bos taurus
Description:
ChEMBL_1501478
Residue:
520
  
Inhibitor
Name:
BDBM50361604
Synonyms:
CHEMBL1939849
Type:
Small organic molecule
Emp. Form.:
C11H14N2O3
Mol. Mass.:
222.2405
SMILES:
OC[C@H]1CN(C(=O)O1)c1ccn(CC=C)c1
: