Target
Collagenase 3
Ligand
BDBM50361635
Substrate
Meas. Tech.
ChEMBL_799144 (CHEMBL1942128)
IC50
150±n/a nM
Citation
 Taylor, SJAbeywardane, ALiang, SMuegge, IPadyana, AKXiong, ZHill-Drzewi, MFarmer, BLi, XCollins, BLi, JXHeim-Riether, AProudfoot, JZhang, QGoldberg, DZuvela-Jelaska, LZaher, HLi, JFarrow, NA Fragment-based discovery of indole inhibitors of matrix metalloproteinase-13. J Med Chem 54:8174-87 (2011)  
Target
Name:
Collagenase 3
Synonyms:
MMP-13 MMP13_HUMAN Matrix metalloproteinase-13 (MMP-13) | Matrix metalloproteinase-13 (MMP13)
Type:
Enzyme
Mol. Mass.:
53808.06
Organism:
Homo sapiens (Human)
Description:
P45452
Residue:
471
  
Inhibitor
Name:
BDBM50361635
Synonyms:
CHEMBL1939878 | US8785489, ethyl 5-{5-methyl-2-[(pyridin-4-ylmethyl)carbamoyl]pyridin-4-yl}-1H-indole-2-carboxylate
Type:
Small organic molecule
Emp. Form.:
C24H22N4O3
Mol. Mass.:
414.4565
SMILES:
CCOC(=O)c1cc2cc(ccc2[nH]1)-c1cc(ncc1C)C(=O)NCc1ccncc1
: