Target
Collagenase 3
Ligand
BDBM50361623
Substrate
Meas. Tech.
ChEMBL_799144 (CHEMBL1942128)
IC50
31000±n/a nM
Citation
 Taylor, SJAbeywardane, ALiang, SMuegge, IPadyana, AKXiong, ZHill-Drzewi, MFarmer, BLi, XCollins, BLi, JXHeim-Riether, AProudfoot, JZhang, QGoldberg, DZuvela-Jelaska, LZaher, HLi, JFarrow, NA Fragment-based discovery of indole inhibitors of matrix metalloproteinase-13. J Med Chem 54:8174-87 (2011)  
Target
Name:
Collagenase 3
Synonyms:
MMP-13 MMP13_HUMAN Matrix metalloproteinase-13 (MMP-13) | Matrix metalloproteinase-13 (MMP13)
Type:
Enzyme
Mol. Mass.:
53808.06
Organism:
Homo sapiens (Human)
Description:
P45452
Residue:
471
  
Inhibitor
Name:
BDBM50361623
Synonyms:
CHEMBL1939865
Type:
Small organic molecule
Emp. Form.:
C13H14N2O3
Mol. Mass.:
246.2619
SMILES:
CCOC(=O)c1cc2cc(NC(C)=O)ccc2[nH]1
: