Target
72 kDa type IV collagenase
Ligand
BDBM50361624
Substrate
Meas. Tech.
ChEMBL_799145 (CHEMBL1942129)
IC50
>500000±n/a nM
Citation
 Taylor, SJAbeywardane, ALiang, SMuegge, IPadyana, AKXiong, ZHill-Drzewi, MFarmer, BLi, XCollins, BLi, JXHeim-Riether, AProudfoot, JZhang, QGoldberg, DZuvela-Jelaska, LZaher, HLi, JFarrow, NA Fragment-based discovery of indole inhibitors of matrix metalloproteinase-13. J Med Chem 54:8174-87 (2011)  
Target
Name:
72 kDa type IV collagenase
Synonyms:
72 kDa gelatinase CLG4A Gelatinase A (MMP-2) MMP2_HUMAN Matrix metalloproteinase-2 (MMP 2) Matrix metalloproteinases 2 (MMP-2) | TBE-1
Type:
Enzyme
Mol. Mass.:
73870.36
Organism:
Homo sapiens (Human)
Description:
P08253
Residue:
660
  
Inhibitor
Name:
BDBM50361624
Synonyms:
CHEMBL1939866
Type:
Small organic molecule
Emp. Form.:
C13H13N3O2
Mol. Mass.:
243.2612
SMILES:
CC(=O)Nc1ccc2[nH]c(cc2c1)C1=NCCO1
: