Target
Collagenase 3
Ligand
BDBM50361636
Substrate
Meas. Tech.
ChEMBL_799149 (CHEMBL1942133)
IC50
56000±n/a nM
Citation
 Taylor, SJAbeywardane, ALiang, SMuegge, IPadyana, AKXiong, ZHill-Drzewi, MFarmer, BLi, XCollins, BLi, JXHeim-Riether, AProudfoot, JZhang, QGoldberg, DZuvela-Jelaska, LZaher, HLi, JFarrow, NA Fragment-based discovery of indole inhibitors of matrix metalloproteinase-13. J Med Chem 54:8174-87 (2011)  
Target
Name:
Collagenase 3
Synonyms:
MMP-13 MMP13_HUMAN Matrix metalloproteinase-13 (MMP-13) | Matrix metalloproteinase-13 (MMP13)
Type:
Enzyme
Mol. Mass.:
53808.06
Organism:
Homo sapiens (Human)
Description:
P45452
Residue:
471
  
Inhibitor
Name:
BDBM50361636
Synonyms:
CHEMBL1939879
Type:
Small organic molecule
Emp. Form.:
C22H18N4O5
Mol. Mass.:
418.4021
SMILES:
Cn1nc(cc1-c1ccc2[nH]c(cc2c1)C(O)=O)C(=O)NCc1ccc(cc1)C(O)=O
: