Target
RAC-alpha serine/threonine-protein kinase
Ligand
BDBM50361651
Substrate
Meas. Tech.
ChEMBL_799352 (CHEMBL1942065)
Ki
10±n/a nM
Citation
 Murphy, STAlton, GBailey, SBaxi, SMBurke, BJChappie, TAErmolieff, JFerre, RGreasley, SHickey, MHumphrey, JKablaoui, NKath, JKazmirski, SKraus, MKupchinsky, SLi, JLingardo, LMarx, MARichter, DTanis, SPTran, KVernier, WXie, ZYin, MJYu, XH Discovery of novel, potent, and selective inhibitors of 3-phosphoinositide-dependent kinase (PDK1). J Med Chem 54:8490-500 (2011)  
Target
Name:
RAC-alpha serine/threonine-protein kinase
Synonyms:
AKT phosphorylation (p-AKT) AKT1/PPP1CA C-AKT PKB alpha Protein kinase B Protein kinase B (Akt 1) Protein kinase B alpha Proto-oncogene Akt (Akt1) Proto-oncogene c-Akt (AKT1) RAC-PK-alpha RAC-alpha serine/threonine-protein kinase (AKT1) | RAC-alpha serine/threonine-protein kinase (pAKT)
Type:
Enzyme
Mol. Mass.:
55681.25
Organism:
Homo sapiens (Human)
Description:
P31749
Residue:
480
  
Inhibitor
Name:
BDBM50361651
Synonyms:
CHEMBL1940249
Type:
Small organic molecule
Emp. Form.:
C24H25FN8O
Mol. Mass.:
460.5067
SMILES:
CC(C)n1cc(C(=O)c2cncc(N[C@@H]3CNC[C@@H]3c3ccc(F)cc3)n2)c2c(N)ncnc12
: