Target
Heat shock protein HSP 90-beta
Ligand
BDBM50361719
Substrate
Meas. Tech.
ChEMBL_798935 (CHEMBL1943442)
IC50
10±n/a nM
Citation
 Baruchello, RSimoni, DGrisolia, GBarbato, GMarchetti, PRondanin, RMangiola, SGiannini, GBrunetti, TAlloatti, DGallo, GCiacci, AVesci, LCastorina, MMilazzo, FMCervoni, MLGuglielmi, MBBarbarino, MFoderà, RPisano, CCabri, W Novel 3,4-isoxazolediamides as potent inhibitors of chaperone heat shock protein 90. J Med Chem 54:8592-604 (2011)  
Target
Name:
Heat shock protein HSP 90-beta
Synonyms:
HS90B_HUMAN HSP 90 HSP90B HSPCB Heat shock protein HSP 90 (Hsp90)
Type:
Molecular Chaperone
Mol. Mass.:
83229.45
Organism:
Homo sapiens (Human)
Description:
P08238
Residue:
724
  
Inhibitor
Name:
BDBM50361719
Synonyms:
CHEMBL1941068
Type:
Small organic molecule
Emp. Form.:
C21H24N4O5S
Mol. Mass.:
444.504
SMILES:
CCNC(=O)c1noc(c1NC(=O)c1sc(C)nc1C)-c1cc(C(C)C)c(O)cc1O
: