Target
Carbonic anhydrase 12
Ligand
BDBM50022178
Substrate
Meas. Tech.
ChEMBL_799274 (CHEMBL1941824)
Ki
8100±n/a nM
Citation
 Touisni, NMaresca, AMcDonald, PCLou, YScozzafava, ADedhar, SWinum, JYSupuran, CT Glycosyl coumarin carbonic anhydrase IX and XII inhibitors strongly attenuate the growth of primary breast tumors. J Med Chem 54:8271-7 (2011)  
Target
Name:
Carbonic anhydrase 12
Synonyms:
CA-XII CAH12_HUMAN Carbonic anhydrase Carbonic anhydrase XII Carbonic anhydrase XII (CAXII) | Tumor antigen HOM-RCC-3.1.3
Type:
Enzyme
Mol. Mass.:
39456.00
Organism:
Homo sapiens (Human)
Description:
Catalytic domain of human cloned isozyme was used in the assay
Residue:
354
  
Inhibitor
Name:
BDBM50022178
Synonyms:
4-Methyl-7-hydroxycoumarin 7-Hydroxy-4-methyl-2-oxo-2H-1-benzopyran 7-Hydroxy-4-methyl-2H-1-benzopyran-2-one 7-Hydroxy-4-methylcoumarin CHEMBL12208 Imecromone cid_5280567
Type:
Small organic molecule
Emp. Form.:
C10H8O3
Mol. Mass.:
176.1687
SMILES:
Cc1cc(=O)oc2cc(O)ccc12
: