Target
Lysosomal Pro-X carboxypeptidase
Ligand
BDBM50361786
Substrate
Meas. Tech.
ChEMBL_799449 (CHEMBL1942257)
IC50
0.3±n/a nM
Citation
 Graham, THShen, HCLiu, WXiong, YVerras, ABleasby, KBhatt, URChabin, RMChen, DChen, QGarcia-Calvo, MGeissler, WMHe, HLassman, MEShen, ZTong, XTung, ECXie, DXu, SColletti, SLTata, JRHale, JJPinto, SShen, DM The discovery of non-benzimidazole and brain-penetrant prolylcarboxypeptidase inhibitors. Bioorg Med Chem Lett 22:658-65 (2011)  
Target
Name:
Lysosomal Pro-X carboxypeptidase
Synonyms:
Angiotensinase C PCP PRCP Prolylcarboxypeptidase | Prolylcarboxypeptidase (PRCP)
Type:
Enzyme
Mol. Mass.:
55805.19
Organism:
Homo sapiens (Human)
Description:
P42785
Residue:
496
  
Inhibitor
Name:
BDBM50361786
Synonyms:
CHEMBL1938522
Type:
Small organic molecule
Emp. Form.:
C26H28ClN3O
Mol. Mass.:
433.973
SMILES:
Clc1ccc(cc1)C(NC(=O)CCN1CCC(CC1)c1ccccc1)c1ccncc1
: