Target
Glutathione S-transferase Mu 1
Ligand
BDBM50361800
Substrate
Meas. Tech.
ChEMBL_799595 (CHEMBL1941301)
Ki
3200±n/a nM
Citation
 Wang, CHWu, HTCheng, HMYen, TJLu, IHChang, HCJao, SCShing, TKLi, WS Inhibition of glutathione S-transferase M1 by new gabosine analogues is essential for overcoming cisplatin resistance in lung cancer cells. J Med Chem 54:8574-81 (2011)  
Target
Name:
Glutathione S-transferase Mu 1
Synonyms:
GST class-mu 1 GSTM1 GSTM1_HUMAN GSTM1b-1b Glutathione S-transferase Mu 1 glutathione S-transferase
Type:
PROTEIN
Mol. Mass.:
25712.03
Organism:
Homo sapiens (Human)
Description:
ChEMBL_799596
Residue:
218
  
Inhibitor
Name:
BDBM50361800
Synonyms:
CHEMBL1938641
Type:
Small organic molecule
Emp. Form.:
C19H32O6
Mol. Mass.:
356.4538
SMILES:
CCCCCCCCCCO[C@H]1CC(COC(C)=O)C(=O)C(=O)[C@H]1O
: