Target
Receptor-type tyrosine-protein kinase FLT3
Ligand
BDBM50361924
Substrate
Meas. Tech.
ChEMBL_800033 (CHEMBL1941739)
IC50
6700±n/a nM
Citation
 Irie, TFujii, ISawa, M Design and combinatorial synthesis of a novel kinase-focused library using click chemistry-based fragment assembly. Bioorg Med Chem Lett 22:591-6 (2011)  
Target
Name:
Receptor-type tyrosine-protein kinase FLT3
Synonyms:
CD135 FL cytokine receptor FLK2 FLT3 Fetal liver kinase-2 Fms-like tyrosine kinase 3 (Flt-3) STK-1 Stem cell tyrosine kinase 1
Type:
Enzyme
Mol. Mass.:
112888.62
Organism:
Homo sapiens (Human)
Description:
P36888
Residue:
993
  
Inhibitor
Name:
BDBM50361924
Synonyms:
CHEMBL1938957
Type:
Small organic molecule
Emp. Form.:
C13H9FN4
Mol. Mass.:
240.2358
SMILES:
Fc1ccc(cc1)-n1cc(nn1)-c1ccccn1
: