Target
C-X-C chemokine receptor type 3
Ligand
BDBM50361984
Substrate
Meas. Tech.
ChEMBL_799099 (CHEMBL1942040)
IC50
22±n/a nM
Citation
 Chen, XMihalic, JDeignan, JGustin, DJDuquette, JDu, XChan, JFu, ZJohnson, MLi, ARHenne, KSullivan, TLemon, BMa, JMiao, STonn, GCollins, TMedina, JC Discovery of potent and specific CXCR3 antagonists. Bioorg Med Chem Lett 22:357-62 (2011)  
Target
Name:
C-X-C chemokine receptor type 3
Synonyms:
AAO92295.1 C-X-C chemokine receptor type 3 (CXCR3) CXCR3 CXCR3_HUMAN chemokine (C-X-C motif) receptor 3
Type:
Enzyme Catalytic Domain
Mol. Mass.:
40665.65
Organism:
Homo sapiens (Human)
Description:
Residue:
368
  
Inhibitor
Name:
BDBM50361984
Synonyms:
CHEMBL1939692
Type:
Small organic molecule
Emp. Form.:
C30H27F5N4O4S
Mol. Mass.:
634.617
SMILES:
C[C@@H](N(CC1CCS(=O)(=O)CC1)C(=O)Cc1ccc(c(F)c1)C(F)(F)F)c1nc2ncccc2c(=O)n1-c1ccc(F)cc1
: