Target
Autoinducer 2-binding periplasmic protein LuxP
Ligand
BDBM50362022
Substrate
Meas. Tech.
ChEMBL_799868 (CHEMBL1941574)
EC50
26500±n/a nM
Citation
 Rui, FMarques, JCMiller, STMaycock, CDXavier, KBVentura, MR Stereochemical diversity of AI-2 analogs modulates quorum sensing in Vibrio harveyi and Escherichia coli. Bioorg Med Chem 20:249-56 (2011)  
Target
Name:
Autoinducer 2-binding periplasmic protein LuxP
Synonyms:
LUXP_VIBHA | luxP
Type:
PROTEIN
Mol. Mass.:
41453.75
Organism:
Vibrio harveyi
Description:
ChEMBL_1513759
Residue:
365
  
Inhibitor
Name:
BDBM50362022
Synonyms:
CHEMBL1939888 | CHEMBL1939890
Type:
Small organic molecule
Emp. Form.:
C6H10O4
Mol. Mass.:
146.1412
SMILES:
CC(O)C(=O)C(=O)[C@@H](C)O
: