Target
Autoinducer 2-binding periplasmic protein LuxP
Ligand
BDBM50362021
Substrate
Meas. Tech.
ChEMBL_799869 (CHEMBL1941575)
IC50
169000±n/a nM
Citation
 Rui, FMarques, JCMiller, STMaycock, CDXavier, KBVentura, MR Stereochemical diversity of AI-2 analogs modulates quorum sensing in Vibrio harveyi and Escherichia coli. Bioorg Med Chem 20:249-56 (2011)  
Target
Name:
Autoinducer 2-binding periplasmic protein LuxP
Synonyms:
LUXP_VIBHA | luxP
Type:
PROTEIN
Mol. Mass.:
41453.75
Organism:
Vibrio harveyi
Description:
ChEMBL_1513759
Residue:
365
  
Inhibitor
Name:
BDBM50362021
Synonyms:
CHEMBL1939887 | CHEMBL1939889
Type:
Small organic molecule
Emp. Form.:
C6H10O4
Mol. Mass.:
146.1412
SMILES:
CC(O)C(=O)C(=O)[C@H](C)O
: