Target
High affinity cAMP-specific and IBMX-insensitive 3',5'-cyclic phosphodiesterase 8A
Ligand
BDBM50362043
Substrate
Meas. Tech.
ChEMBL_798761 (CHEMBL1942896)
Ki
>10000±n/a nM
Citation
 Yang, SWSmotryski, JMcElroy, WTTan, ZHo, GTulshian, DGreenlee, WJGuzzi, MZhang, XMullins, DXiao, LHruza, AChan, TMRindgen, DBleickardt, CHodgson, R Discovery of orally active pyrazoloquinolines as potent PDE10 inhibitors for the management of schizophrenia. Bioorg Med Chem Lett 22:235-9 (2011)  
Target
Name:
High affinity cAMP-specific and IBMX-insensitive 3',5'-cyclic phosphodiesterase 8A
Synonyms:
High-affinity cAMP-specific and IBMX-insensitive 3 ,5 -cyclic phosphodiesterase 8A PDE8A_HUMAN Phosphodiesterase 8 (PDE8) Phosphodiesterase 8A (PDE8A1) Phosphodiesterase Type 8 (PDE8A)
Type:
Enzyme Catalytic Domain
Mol. Mass.:
93295.89
Organism:
Homo sapiens (Human)
Description:
Recombinant catalytic domain (M1-E829) of human PDE8A.
Residue:
829
  
Inhibitor
Name:
BDBM50362043
Synonyms:
CHEMBL1940053
Type:
Small organic molecule
Emp. Form.:
C19H24N4O2
Mol. Mass.:
340.4195
SMILES:
COc1cc(C)c2nc3[nH]nc(C)c3c(CN3CCCOCC3)c2c1
: