Target
Corticotropin-releasing factor receptor 1
Ligand
BDBM50362272
Substrate
Meas. Tech.
ChEMBL_798649 (CHEMBL1942638)
EC50
7.4±n/a nM
Citation
 Saito, TObitsu, TKohno, HSugimoto, IMatsushita, TNishiyama, THirota, TTakeda, HMatsumura, NUeno, SKishi, AKagamiishi, YNakai, HTakaoka, Y Pyrrolo[1,2-b]pyridazines, pyrrolo[2,1-f]triazin-4(3H)-ones, and related compounds as novel corticotropin-releasing factor 1 (CRF¿?) receptor antagonists. Bioorg Med Chem 20:1122-38 (2012)  
Target
Name:
Corticotropin-releasing factor receptor 1
Synonyms:
CRF-R CRF1 CRFR1 CRH-R 1 CRHR1 Corticotropin-releasing factor receptor 1 (CRF-1) Corticotropin-releasing hormone receptor 1
Type:
Enzyme
Mol. Mass.:
50744.31
Organism:
Homo sapiens (Human)
Description:
P34998
Residue:
444
  
Inhibitor
Name:
BDBM50362272
Synonyms:
CHEMBL1939596
Type:
Small organic molecule
Emp. Form.:
C18H20ClN3O2
Mol. Mass.:
345.823
SMILES:
COc1ccc(c(Cl)c1)-c1nn2c(C)cc(C(C)C)c2c(=O)n1C
: