Target
B1 bradykinin receptor
Ligand
BDBM50362361
Substrate
Meas. Tech.
ChEMBL_797692 (CHEMBL1943912)
IC50
0.4±n/a nM
Citation
 Qian, WChen, JJHuman, JAya, TZhu, JBiswas, KPeterkin, THungate, RWArik, LJohnson, EKumar, GJoseph, SJona, JGuo, HXWu, Z Discovery of dehydro-oxopiperazine acetamides as novel bradykinin B1 receptor antagonists with enhanced in vitro potency. Bioorg Med Chem Lett 22:1061-7 (2012)  
Target
Name:
B1 bradykinin receptor
Synonyms:
B1 BRADYKININ B1R BK-1 receptor BRADYB1 | Bradykinin B1 receptor
Type:
Enzyme
Mol. Mass.:
40508.87
Organism:
Homo sapiens (Human)
Description:
P46663
Residue:
353
  
Inhibitor
Name:
BDBM50362361
Synonyms:
CHEMBL1939760
Type:
Small organic molecule
Emp. Form.:
C29H38N4O4S
Mol. Mass.:
538.701
SMILES:
Cc1ccc(cc1)S(=O)(=O)N1C=CNC(=O)[C@H]1CC(=O)N[C@@H]1CCCc2cc(CNCC(C)(C)C)ccc12
: