Target
Neuropeptides B/W receptor type 1
Ligand
BDBM50362426
Substrate
Meas. Tech.
ChEMBL_797950 (CHEMBL1942827)
IC50
82±n/a nM
Citation
 Anthony Romero, FHastings, NBMoningka, RGuo, ZWang, MDi Salvo, JLei, YTrusca, DDeng, QTong, VTerebetski, JLBall, RGUjjainwalla, F The discovery of potent antagonists of NPBWR1 (GPR7). Bioorg Med Chem Lett 22:1014-8 (2012)  
Target
Name:
Neuropeptides B/W receptor type 1
Synonyms:
G-protein coupled receptor 7 NPBW1_MOUSE | Npbwr1
Type:
PROTEIN
Mol. Mass.:
36085.77
Organism:
Mus musculus
Description:
ChEMBL_797950
Residue:
329
  
Inhibitor
Name:
BDBM50362426
Synonyms:
CHEMBL1940530
Type:
Small organic molecule
Emp. Form.:
C30H34BrClN4OS
Mol. Mass.:
614.039
SMILES:
Clc1ccc(nc1)N1CCN(CC1)C(=O)[C@H]1CC[C@H](C[C@@H]1c1ccsc1)NC1(CCC1)c1ccc(Br)cc1
: