Target
Focal adhesion kinase 1
Ligand
BDBM50362525
Substrate
Meas. Tech.
ChEMBL_797726 (CHEMBL1944085)
IC50
960±n/a nM
Citation
 Bijian, KZhang, ZXu, BJie, SChen, BWan, SWu, JJiang, TAlaoui-Jamali, MA Synthesis and biological activity of novel organoselenium derivatives targeting multiple kinases and capable of inhibiting cancer progression to metastases. Eur J Med Chem 48:143-52 (2012)  
Target
Name:
Focal adhesion kinase 1
Synonyms:
FADK 1 FAK1 FLT4 Focal adhesion kinase (FAK) Focal adhesion kinase 1 (FAK) Focal adhesion kinase-related nonkinase PTK2 Protein-tyrosine kinase 2 p125FAK | pp125FAK
Type:
Tyrosine-protein kinase
Mol. Mass.:
119233.17
Organism:
Homo sapiens (Human)
Description:
Q05397
Residue:
1052
  
Inhibitor
Name:
BDBM50362525
Synonyms:
CHEMBL1940999
Type:
Small organic molecule
Emp. Form.:
C17H22N2O7Se
Mol. Mass.:
445.33
SMILES:
OC[C@H]1O[C@@H](NC(=O)CCCn2[se]c3ccccc3c2=O)[C@H](O)[C@@H](O)[C@@H]1O
: