Target
Aldo-keto reductase family 1 member B10
Ligand
BDBM50362835
Substrate
Meas. Tech.
ChEMBL_798534 (CHEMBL1942331)
IC50
6.2±n/a nM
Citation
 Soda, MHu, DEndo, STakemura, MLi, JWada, RIfuku, SZhao, HTEl-Kabbani, OOhta, SYamamura, KToyooka, NHara, AMatsunaga, T Design, synthesis and evaluation of caffeic acid phenethyl ester-based inhibitors targeting a selectivity pocket in the active site of human aldo-keto reductase 1B10. Eur J Med Chem 48:321-9 (2012)  
Target
Name:
Aldo-keto reductase family 1 member B10
Synonyms:
AK1BA_HUMAN AKR1B11 ARP Aldo-keto reductase family 1 member B10 (AKR1B10) Aldose reductase-like SI reductase hARP
Type:
Protein
Mol. Mass.:
36024.67
Organism:
Homo sapiens (Human)
Description:
O60218. 1ZUA; 4JII; 4GQ0
Residue:
316
  
Inhibitor
Name:
BDBM50362835
Synonyms:
CHEMBL1940400
Type:
Small organic molecule
Emp. Form.:
C19H20O5
Mol. Mass.:
328.3591
SMILES:
COc1cc(O)ccc1\C=C\C(=O)OCCCc1cccc(O)c1
: