Target
D(4) dopamine receptor
Ligand
BDBM50362856
Substrate
Meas. Tech.
ChEMBL_797753 (CHEMBL1944112)
Ki
6.9±n/a nM
Citation
 Peprah, KZhu, XYEyunni, SVSetola, VRoth, BLAblordeppey, SY Multi-receptor drug design: Haloperidol as a scaffold for the design and synthesis of atypical antipsychotic agents. Bioorg Med Chem 20:1291-7 (2012)  
Target
Name:
D(4) dopamine receptor
Synonyms:
D(4) dopamine receptor DOPAMINE D4.4 Dopamine receptor | Drd4
Type:
Enzyme Catalytic Domain
Mol. Mass.:
41307.65
Organism:
RAT
Description:
DOPAMINE D4.4 0 RAT::P30729
Residue:
387
  
Inhibitor
Name:
BDBM50362856
Synonyms:
CHEMBL1940411
Type:
Small organic molecule
Emp. Form.:
C19H22ClFN2O
Mol. Mass.:
348.842
SMILES:
Fc1ccc(OCCCN2CCN(CC2)c2ccc(Cl)cc2)cc1
: