Target
5-hydroxytryptamine receptor 1A
Ligand
BDBM50362852
Substrate
Meas. Tech.
ChEMBL_797754 (CHEMBL1944113)
Ki
613±n/a nM
Citation
 Peprah, KZhu, XYEyunni, SVSetola, VRoth, BLAblordeppey, SY Multi-receptor drug design: Haloperidol as a scaffold for the design and synthesis of atypical antipsychotic agents. Bioorg Med Chem 20:1291-7 (2012)  
Target
Name:
5-hydroxytryptamine receptor 1A
Synonyms:
5-HT-1A 5-hydroxytryptamine receptor 1A (5-HT-1A) ADRB2RL1 Dopamine D2 receptor and serotonin 1a receptor HTR1A | Serotonin receptor 1A
Type:
Mol. Mass.:
46122.49
Organism:
Homo sapiens (Human)
Description:
Residue:
422
  
Inhibitor
Name:
BDBM50362852
Synonyms:
CHEMBL1940407
Type:
Small organic molecule
Emp. Form.:
C20H23ClFNOS
Mol. Mass.:
379.919
SMILES:
Fc1ccc(cc1)S(=O)CCCN1CCC(CC1)c1ccc(Cl)cc1
: