Target
5-hydroxytryptamine receptor 1A
Ligand
BDBM50362865
Substrate
Meas. Tech.
ChEMBL_797754 (CHEMBL1944113)
Ki
3.6±n/a nM
Citation
 Peprah, KZhu, XYEyunni, SVSetola, VRoth, BLAblordeppey, SY Multi-receptor drug design: Haloperidol as a scaffold for the design and synthesis of atypical antipsychotic agents. Bioorg Med Chem 20:1291-7 (2012)  
Target
Name:
5-hydroxytryptamine receptor 1A
Synonyms:
5-HT-1A 5-hydroxytryptamine receptor 1A (5-HT-1A) ADRB2RL1 Dopamine D2 receptor and serotonin 1a receptor HTR1A | Serotonin receptor 1A
Type:
Mol. Mass.:
46122.49
Organism:
Homo sapiens (Human)
Description:
Residue:
422
  
Inhibitor
Name:
BDBM50362865
Synonyms:
CHEMBL1940420
Type:
Small organic molecule
Emp. Form.:
C18H22FN3O
Mol. Mass.:
315.3852
SMILES:
Fc1ccc(OCCCN2CCN(CC2)c2ccccn2)cc1
: