Target
5-hydroxytryptamine receptor 2A
Ligand
BDBM50362856
Substrate
Meas. Tech.
ChEMBL_797755 (CHEMBL1944114)
Ki
60±n/a nM
Citation
 Peprah, KZhu, XYEyunni, SVSetola, VRoth, BLAblordeppey, SY Multi-receptor drug design: Haloperidol as a scaffold for the design and synthesis of atypical antipsychotic agents. Bioorg Med Chem 20:1291-7 (2012)  
Target
Name:
5-hydroxytryptamine receptor 2A
Synonyms:
5-HT-2 5-HT2A 5-hydroxytryptamine receptor 2A (5HT-2A) 5HT2A_HUMAN HTR2A | Serotonin receptor 2A
Type:
undefined
Mol. Mass.:
52607.65
Organism:
Homo sapiens (Human)
Description:
P28223
Residue:
471
  
Inhibitor
Name:
BDBM50362856
Synonyms:
CHEMBL1940411
Type:
Small organic molecule
Emp. Form.:
C19H22ClFN2O
Mol. Mass.:
348.842
SMILES:
Fc1ccc(OCCCN2CCN(CC2)c2ccc(Cl)cc2)cc1
: