Target
5-hydroxytryptamine receptor 2C
Ligand
BDBM50362870
Substrate
Meas. Tech.
ChEMBL_797756 (CHEMBL1944115)
Ki
>10000±n/a nM
Citation
 Peprah, KZhu, XYEyunni, SVSetola, VRoth, BLAblordeppey, SY Multi-receptor drug design: Haloperidol as a scaffold for the design and synthesis of atypical antipsychotic agents. Bioorg Med Chem 20:1291-7 (2012)  
Target
Name:
5-hydroxytryptamine receptor 2C
Synonyms:
5-HT2C 5-hydroxytryptamine receptor 2C (5HT2c) 5ht1c Htr2c Serotonin receptor 2a and 2c (5HT2A and 5HT2C)
Type:
Enzyme
Mol. Mass.:
51935.10
Organism:
Rattus norvegicus (Rat)
Description:
P08909
Residue:
460
  
Inhibitor
Name:
BDBM50362870
Synonyms:
CHEMBL1940406
Type:
Small organic molecule
Emp. Form.:
C20H23ClFNO
Mol. Mass.:
347.854
SMILES:
Fc1ccc(OCCCN2CCC(CC2)c2ccc(Cl)cc2)cc1
: