Target
D(2) dopamine receptor
Ligand
BDBM50362869
Substrate
Meas. Tech.
ChEMBL_797751 (CHEMBL1944110)
Ki
185±n/a nM
Citation
 Peprah, KZhu, XYEyunni, SVSetola, VRoth, BLAblordeppey, SY Multi-receptor drug design: Haloperidol as a scaffold for the design and synthesis of atypical antipsychotic agents. Bioorg Med Chem 20:1291-7 (2012)  
Target
Name:
D(2) dopamine receptor
Synonyms:
D(2) dopamine receptor DOPAMINE D2 Long DRD2 Dopamine D2 receptor Dopamine D2 receptor (D2R) Dopamine2-like | d2
Type:
Cell-surface receptors
Mol. Mass.:
50647.10
Organism:
Homo sapiens (Human)
Description:
P14416
Residue:
443
  
Inhibitor
Name:
BDBM50362869
Synonyms:
CHEMBL1940405
Type:
Small organic molecule
Emp. Form.:
C20H23ClFNS
Mol. Mass.:
363.92
SMILES:
Fc1ccc(SCCCN2CCC(CC2)c2ccc(Cl)cc2)cc1
: