Target
D(2) dopamine receptor
Ligand
BDBM50362857
Substrate
Meas. Tech.
ChEMBL_797751 (CHEMBL1944110)
Ki
37±n/a nM
Citation
 Peprah, KZhu, XYEyunni, SVSetola, VRoth, BLAblordeppey, SY Multi-receptor drug design: Haloperidol as a scaffold for the design and synthesis of atypical antipsychotic agents. Bioorg Med Chem 20:1291-7 (2012)  
Target
Name:
D(2) dopamine receptor
Synonyms:
D(2) dopamine receptor DOPAMINE D2 Long DRD2 Dopamine D2 receptor Dopamine D2 receptor (D2R) Dopamine2-like | d2
Type:
Cell-surface receptors
Mol. Mass.:
50647.10
Organism:
Homo sapiens (Human)
Description:
P14416
Residue:
443
  
Inhibitor
Name:
BDBM50362857
Synonyms:
CHEMBL1940412
Type:
Small organic molecule
Emp. Form.:
C19H23FN2O
Mol. Mass.:
314.3971
SMILES:
Fc1ccc(OCCCN2CCN(CC2)c2ccccc2)cc1
: