Target
Acetylcholinesterase
Ligand
BDBM50362877
Substrate
Meas. Tech.
ChEMBL_798011 (CHEMBL1942987)
IC50
0.236±n/a nM
Citation
 Anand, PSingh, BSingh, N A review on coumarins as acetylcholinesterase inhibitors for Alzheimer's disease. Bioorg Med Chem 20:1175-80 (2012)  
Target
Name:
Acetylcholinesterase
Synonyms:
ACES_HUMAN Acetylcholinesterase (AChE) | Acetylcholinesterase (human AChE)
Type:
Enzyme
Mol. Mass.:
67792.70
Organism:
Homo sapiens (Human)
Description:
P22303
Residue:
614
  
Inhibitor
Name:
BDBM50362877
Synonyms:
CHEMBL1940738
Type:
Small organic molecule
Emp. Form.:
C24H29NO7
Mol. Mass.:
443.4896
SMILES:
COc1cc2oc(=O)c(OCCCCOc3cc(O)cc(c3)N(C)C)c(C)c2cc1OC
: