Target
Riboflavin-binding protein
Ligand
BDBM50015214
Substrate
Meas. Tech.
ChEMBL_800331 (CHEMBL1948177)
Ki
6700±n/a nM
Citation
 Plantinga, AWitte, ALi, MHHarmon, AChoi, SKBanaszak Holl, MMOrr, BGBaker, JRSinniah, K Bioanalytical Screening of Riboflavin Antagonists for Targeted Drug Delivery - A Thermodynamic and Kinetic Study. ACS Med Chem Lett 2:363-367 (2011)  
Target
Name:
Riboflavin-binding protein
Synonyms:
RBP Riboflavin-binding protein, plasma form Riboflavin-binding protein, yolk minor form
Type:
PROTEIN
Mol. Mass.:
27203.20
Organism:
Gallus gallus
Description:
ChEMBL_800332
Residue:
238
  
Inhibitor
Name:
BDBM50015214
Synonyms:
6-chloro-2-methoxy-9-acridinyl(4-diethylamino-1-methylbutyl)amine CHEMBL7568 N*4*-(6-Chloro-2-methoxy-acridin-9-yl)-N*1*,N*1*-diethyl-pentane-1,4-diamine N*4*-(6-Chloro-2-methoxy-acridin-9-yl)-N*1*,N*1*-diethyl-pentane-1,4-diamine ; (mepacrine) cid_237 | quinacrine
Type:
Small organic molecule
Emp. Form.:
C23H30ClN3O
Mol. Mass.:
399.957
SMILES:
CCN(CC)CCCC(C)Nc1c2ccc(Cl)cc2nc2ccc(OC)cc12
: