Target
Prostaglandin G/H synthase 1
Ligand
BDBM50169047
Substrate
Meas. Tech.
ChEMBL_800278 (CHEMBL1948028)
IC50
99±n/a nM
Citation
 Su, HXie, YLiu, WBYou, SL Methyl-monofluorination of ibuprofen selectively increases its inhibitory activity toward cyclooxygenase-1 leading to enhanced analgesic activity and reduced gastric damage in vivo. Bioorg Med Chem Lett 21:3578-82 (2011)  
Target
Name:
Prostaglandin G/H synthase 1
Synonyms:
COX-1 Cyclooxygenase Cyclooxygenase-1 (COX-1) PTGS1 | Prostaglandin G/H synthase (cyclooxygenase)
Type:
Enzyme
Mol. Mass.:
68692.62
Organism:
Homo sapiens (Human)
Description:
P23219
Residue:
599
  
Inhibitor
Name:
BDBM50169047
Synonyms:
(S)-2-(4-Isobutyl-phenyl)-propionic acid (S)-ibuprofen DEXIBUPROFEN | IBUPROFEN LYSINE
Type:
Small organic molecule
Emp. Form.:
C13H18O2
Mol. Mass.:
206.2808
SMILES:
CC(C)Cc1ccc(cc1)[C@H](C)C(O)=O
: