Target
Serine/threonine-protein kinase mTOR
Ligand
BDBM50362940
Substrate
Meas. Tech.
ChEMBL_801030 (CHEMBL1948804)
IC50
10±n/a nM
Citation
 Mortensen, DSPerrin-Ninkovic, SMHarris, RLee, BGShevlin, GHickman, MKhambatta, GBisonette, RRFultz, KESankar, S Discovery and SAR exploration of a novel series of imidazo[4,5-b]pyrazin-2-ones as potent and selective mTOR kinase inhibitors. Bioorg Med Chem Lett 21:6793-9 (2011)  
Target
Name:
Serine/threonine-protein kinase mTOR
Synonyms:
FK506-binding protein 12-rapamycin complex-associated protein 1 FRAP FRAP1 MTOR Mammalian Target of Rapamycin (mTOR) RAFT1 Rapamycin and FKBP12 target 1 Serine/threonine-protein kinase (mTOR) | mTORC2
Type:
Rapamycin target protein
Mol. Mass.:
288917.12
Organism:
Homo sapiens (Human)
Description:
P42345
Residue:
2549
  
Inhibitor
Name:
BDBM50362940
Synonyms:
CHEMBL1946263
Type:
Small organic molecule
Emp. Form.:
C18H19N7O2
Mol. Mass.:
365.3892
SMILES:
Nc1nc2ccc(cc2[nH]1)-c1cnc2[nH]c(=O)n(CC3CCOCC3)c2n1
: