Target
Peroxisome proliferator-activated receptor gamma
Ligand
BDBM50362962
Substrate
Meas. Tech.
ChEMBL_801271 (CHEMBL1947820)
IC50
3657±n/a nM
Citation
 Liu, WLau, FLiu, KWood, HBZhou, GChen, YLi, YAkiyama, TECastriota, GEinstein, MWang, CMcCann, MEDoebber, TWWu, MChang, CHMcNamara, LMcKeever, BMosley, RTBerger, JPMeinke, PT Benzimidazolones: a new class of selective peroxisome proliferator-activated receptor¿ (PPAR¿) modulators. J Med Chem 54:8541-54 (2011)  
Target
Name:
Peroxisome proliferator-activated receptor gamma
Synonyms:
NR1C3 PPAR-gamma PPARG_HUMAN Peroxisome proliferator-activated receptor gamma (PPAR gamma) Peroxisome proliferator-activated receptor gamma (PPARĪ³) peroxisome proliferator-activated receptor gamma isoform 2
Type:
Nuclear Receptor
Mol. Mass.:
57613.46
Organism:
Homo sapiens (Human)
Description:
P37231
Residue:
505
  
Inhibitor
Name:
BDBM50362962
Synonyms:
CHEMBL1946955
Type:
Small organic molecule
Emp. Form.:
C27H22F3N3O6
Mol. Mass.:
541.4753
SMILES:
CC[C@@H](Oc1cccc(Cn2c3cc(ccc3n(-c3noc4cc(OC)ccc34)c2=O)C(F)(F)F)c1)C(O)=O
: