Target
Peroxisome proliferator-activated receptor gamma
Ligand
BDBM50362957
Substrate
Meas. Tech.
ChEMBL_801272 (CHEMBL1947821)
EC50
83±n/a nM
Citation
 Liu, WLau, FLiu, KWood, HBZhou, GChen, YLi, YAkiyama, TECastriota, GEinstein, MWang, CMcCann, MEDoebber, TWWu, MChang, CHMcNamara, LMcKeever, BMosley, RTBerger, JPMeinke, PT Benzimidazolones: a new class of selective peroxisome proliferator-activated receptor¿ (PPAR¿) modulators. J Med Chem 54:8541-54 (2011)  
Target
Name:
Peroxisome proliferator-activated receptor gamma
Synonyms:
NR1C3 PPAR-gamma PPARG_HUMAN Peroxisome proliferator-activated receptor gamma (PPAR gamma) Peroxisome proliferator-activated receptor gamma (PPARĪ³) peroxisome proliferator-activated receptor gamma isoform 2
Type:
Nuclear Receptor
Mol. Mass.:
57613.46
Organism:
Homo sapiens (Human)
Description:
P37231
Residue:
505
  
Inhibitor
Name:
BDBM50362957
Synonyms:
CHEMBL1946757
Type:
Small organic molecule
Emp. Form.:
C26H19ClF3N3O6
Mol. Mass.:
561.894
SMILES:
COc1ccc2c(noc2c1)-n1c2cc(ccc2n(Cc2ccc(Cl)c(O[C@H](C)C(O)=O)c2)c1=O)C(F)(F)F
: