Target
Peroxisome proliferator-activated receptor gamma
Ligand
BDBM50362965
Substrate
Meas. Tech.
ChEMBL_801272 (CHEMBL1947821)
EC50
237±n/a nM
Citation
 Liu, WLau, FLiu, KWood, HBZhou, GChen, YLi, YAkiyama, TECastriota, GEinstein, MWang, CMcCann, MEDoebber, TWWu, MChang, CHMcNamara, LMcKeever, BMosley, RTBerger, JPMeinke, PT Benzimidazolones: a new class of selective peroxisome proliferator-activated receptor¿ (PPAR¿) modulators. J Med Chem 54:8541-54 (2011)  
Target
Name:
Peroxisome proliferator-activated receptor gamma
Synonyms:
NR1C3 PPAR-gamma PPARG_HUMAN Peroxisome proliferator-activated receptor gamma (PPAR gamma) Peroxisome proliferator-activated receptor gamma (PPARĪ³) peroxisome proliferator-activated receptor gamma isoform 2
Type:
Nuclear Receptor
Mol. Mass.:
57613.46
Organism:
Homo sapiens (Human)
Description:
P37231
Residue:
505
  
Inhibitor
Name:
BDBM50362965
Synonyms:
CHEMBL1947140
Type:
Small organic molecule
Emp. Form.:
C27H19F3N4O6
Mol. Mass.:
552.4582
SMILES:
COc1ccc2c(noc2c1)-n1c2ccc(cc2n(Cc2cccc(c2)[C@@]2(C)OC(O)=NC2=O)c1=O)C(F)(F)F
: