Target
Serine/threonine-protein kinase PLK3
Ligand
BDBM50362987
Substrate
Meas. Tech.
ChEMBL_800413 (CHEMBL1948344)
IC50
1100±n/a nM
Citation
 Duffey, MOVos, TJAdams, RAlley, JAnthony, JBarrett, CBharathan, IBowman, DBump, NJChau, RCullis, CDriscoll, DLElder, AForsyth, NFrazer, JGuo, JGuo, LHyer, MLJanowick, DKulkarni, BLai, SJLasky, KLi, GLi, JLiao, DLittle, JPeng, BQian, MGReynolds, DJRezaei, MScott, MPSells, TBShinde, VShi, QJSintchak, MDSoucy, FSprott, KTStroud, SGNestor, MVisiers, IWeatherhead, GYe, YD'Amore, N Discovery of a potent and orally bioavailable benzolactam-derived inhibitor of Polo-like kinase 1 (MLN0905). J Med Chem 55:197-208 (2012)  
Target
Name:
Serine/threonine-protein kinase PLK3
Synonyms:
CNK FGF-inducible kinase PLK3 PRK Proliferation-related kinase | Serine/threonine-protein kinase PLK3
Type:
Serine/threonine-protein kinase
Mol. Mass.:
71655.17
Organism:
Homo sapiens (Human)
Description:
Enzyme assays were using PLK3 purified from baculovirus-infected Trichoplusia ni cells expressing full-length PLK3.
Residue:
646
  
Inhibitor
Name:
BDBM50362987
Synonyms:
CHEMBL1945499
Type:
Small organic molecule
Emp. Form.:
C26H30ClN5S
Mol. Mass.:
480.068
SMILES:
CC(C)c1ccc(CCCN(C)C)cc1Nc1ncc2CC(=S)Nc3cc(Cl)ccc3-c2n1
: