Target
Aldo-keto reductase family 1 member B1
Ligand
BDBM50363056
Substrate
Meas. Tech.
ChEMBL_800764 (CHEMBL1948100)
IC50
10000±n/a nM
Citation
 Minehira, DTakeda, DUrata, HKato, AAdachi, IWang, XMatsuya, YSugimoto, KTakemura, MEndo, SMatsunaga, THara, AKoseki, JNarukawa, KHirono, SToyooka, N Design, synthesis, and biological evaluation of novel (1-thioxo-1,2,3,4-tetrahydro-ß-carbolin-9-yl)acetic acids as selective inhibitors for AKR1B1. Bioorg Med Chem 20:356-67 (2011)  
Target
Name:
Aldo-keto reductase family 1 member B1
Synonyms:
AKR1B1 ALDR_HUMAN AR Aldose Reductase (ALR2) Aldose reductase (AR)
Type:
Protein
Mol. Mass.:
35855.50
Organism:
Homo sapiens (Human)
Description:
P15121. 4LAU; 2IKI; 4LB4; 2FZD; 2FZ8; 1US0
Residue:
316
  
Inhibitor
Name:
BDBM50363056
Synonyms:
CHEMBL1946961
Type:
Small organic molecule
Emp. Form.:
C21H16F4N2O2S
Mol. Mass.:
436.423
SMILES:
OC(=O)Cn1c2c(CCN(Cc3ccc(cc3)C(F)(F)F)C2=S)c2cc(F)ccc12
: